Target
Muscarinic acetylcholine receptor M1
Ligand
BDBM50008072
Substrate
Ki
9930±n/a nM
Comments
PDSP_1492
Citation
 Wei, HBRoeske, WRLai, JWanibuchi, FHidaka, KUsuda, SYamamura, HI Pharmacological characterization of a novel muscarinic partial agonist, YM796, in transfected cells expressing the m1 or m2 muscarinic receptor gene. Life Sci 50:355-63 (1992)  
Target
Name:
Muscarinic acetylcholine receptor M1
Synonyms:
ACM1_RAT Chrm-1 cholinergic receptor, muscarinic 1
Type:
Enzyme Catalytic Domain
Mol. Mass.:
51390.46
Organism:
RAT
Description:
P08482
Residue:
460
  
Inhibitor
Name:
BDBM50008072
Synonyms:
(+)-pilocarpine (3S,4R)-3-ethyldihydro-4-((1-methyl-1H-imidazol-5-yl)methyl)-2(3H)-furanone CHEMBL550 PILOCARPINE | PILOCARPINE HYDROCHLORIDE
Type:
Small organic molecule
Emp. Form.:
C11H16N2O2
Mol. Mass.:
208.2569
SMILES:
CC[C@H]1[C@@H](Cc2cncn2C)COC1=O
: