Target
Sentrin-specific protease 7
Ligand
BDBM81516
Substrate
Meas. Tech.
Fluorogenic Assay
pH
8±0
Temperature
310.15±0 K
IC50
>1.00e+5±n/a nM
Citation
 Albrow, VEPonder, ELFasci, DBékés, MDeu, ESalvesen, GSBogyo, M Development of small molecule inhibitors and probes of human SUMO deconjugating proteases. Chem Biol 18:722-32 (2011)  
Target
Name:
Sentrin-specific protease 7
Synonyms:
KIAA1707 SENP7_HUMAN SUSP2 | Sentrin-specific protease 7 (SENP7)
Type:
Protein
Mol. Mass.:
119657.39
Organism:
Homo sapiens (Human)
Description:
Q9BQF6
Residue:
1050
  
Inhibitor
Name:
BDBM81516
Synonyms:
VEA-500
Type:
Small organic molecule
Emp. Form.:
C42H46N8O14
Mol. Mass.:
886.8598
SMILES:
C[C@H](O)C(NC(=O)[C@H](CCC(N)=O)NC(=O)[C@H](CCC(N)=O)NC(=O)Cc1ccc(O)c(c1)N(=O)=O)C(=O)NCC(=O)NCC(=O)COC(=O)c1c2ccccc2cc2ccccc12
: