Target
Sentrin-specific protease 7
Ligand
BDBM81517
Substrate
Meas. Tech.
Fluorogenic Assay
pH
8±0
Temperature
310.15±0 K
IC50
4.3e+3± 7e+2 nM
Citation
 Albrow, VEPonder, ELFasci, DBékés, MDeu, ESalvesen, GSBogyo, M Development of small molecule inhibitors and probes of human SUMO deconjugating proteases. Chem Biol 18:722-32 (2011)  
Target
Name:
Sentrin-specific protease 7
Synonyms:
KIAA1707 SENP7_HUMAN SUSP2 | Sentrin-specific protease 7 (SENP7)
Type:
Protein
Mol. Mass.:
119657.39
Organism:
Homo sapiens (Human)
Description:
Q9BQF6
Residue:
1050
  
Inhibitor
Name:
BDBM81517
Synonyms:
VEA-561
Type:
Small organic molecule
Emp. Form.:
C40H46N8O10
Mol. Mass.:
798.8408
SMILES:
[#6]-[#6](-[#6])-[#6]-[#6@H](-[#7]-[#6](=O)-[#6]-c1ccc(-[#8])c(c1)N(=O)=O)-[#6](=O)-[#7]-[#6@@H](-[#6]-[#6]-[#6]\[#7]=[#6](\[#7])-[#7])-[#6](=O)-[#7]-[#6]-[#6](=O)-[#7]-[#6]-[#6](=O)-[#6]-[#8]-[#6](=O)-c1c2ccccc2cc2ccccc12
: