Target
Histamine H1 receptor
Ligand
BDBM81541
Substrate
Ki
0.03±n/a nM
Comments
PDSP_1677
Citation
 Hill, SJ Multiple histamine receptors: properties and functional characteristics. Biochem Soc Trans 20:122-5 (1992)  
Target
Name:
Histamine H1 receptor
Synonyms:
HISTAMINE H1 HRH1_CAVPO
Type:
G Protein-Coupled Receptor (GPCR)
Mol. Mass.:
55641.53
Organism:
Cavia porcellus (domestic guinea pig)
Description:
Guinea pig cerebellum was used in binding assay.
Residue:
488
  
Inhibitor
Name:
BDBM81541
Synonyms:
CAS_195530 S-Beta-Dimethylhistamine-R-alpha
Type:
Small organic molecule
Emp. Form.:
C7H13N3
Mol. Mass.:
139.1982
SMILES:
CC(N)C(C)c1cnc[nH]1
: