Target
Histamine H3 receptor
Ligand
BDBM81542
Substrate
Ki
282±n/a nM
Comments
PDSP_359
Citation
 Hill, SJ Multiple histamine receptors: properties and functional characteristics. Biochem Soc Trans 20:122-5 (1992)  
Target
Name:
Histamine H3 receptor
Synonyms:
HISTAMINE H3 HRH3_CAVPO | Histamine H3 receptor
Type:
Enzyme Catalytic Domain
Mol. Mass.:
48753.61
Organism:
GUINEA PIG
Description:
HISTAMINE H3 HRH3 GUINEA PIG::Q9JI35
Residue:
445
  
Inhibitor
Name:
BDBM81542
Synonyms:
Beta-Methylhistamine NSC_565544
Type:
Small organic molecule
Emp. Form.:
C6H11N3
Mol. Mass.:
125.1716
SMILES:
CC(CN)c1cnc[nH]1
: