Target
Proto-oncogene tyrosine-protein kinase Src
Ligand
BDBM27216
Substrate
Meas. Tech.
Kinase Inhibition Assay
pH
7.4±0
Temperature
277.15±0 K
IC50
2.4e+2±n/a nM
Citation
 Dalgarno, DStehle, TNarula, SSchelling, Pvan Schravendijk, MRAdams, SAndrade, LKeats, JRam, MJin, LGrossman, TMacNeil, IMetcalf, CShakespeare, WWang, YKeenan, TSundaramoorthi, RBohacek, RWeigele, MSawyer, T Structural basis of Src tyrosine kinase inhibition with a new class of potent and selective trisubstituted purine-based compounds. Chem Biol Drug Des 67:46-57 (2006)  
Target
Name:
Proto-oncogene tyrosine-protein kinase Src
Synonyms:
Calmodulin/Proto-oncogene tyrosine-protein kinase Src Proto-oncogene c-Src SRC SRC_HUMAN V-src sarcoma (Schmidt-Ruppin A-2) viral oncogene homolog (avian) p60-Src | pp60c-src
Type:
Protein
Mol. Mass.:
59838.60
Organism:
Homo sapiens (Human)
Description:
P12931
Residue:
536
  
Inhibitor
Name:
BDBM27216
Synonyms:
(2R)-2-({6-[(3-chlorophenyl)amino]-9-(propan-2-yl)-9H-purin-2-yl}amino)-3-methylbutan-1-ol CHEMBL23327 | Purvalanol A
Type:
Small organic molecule
Emp. Form.:
C19H25ClN6O
Mol. Mass.:
388.894
SMILES:
CC(C)[C@H](CO)Nc1nc(Nc2cccc(Cl)c2)c2ncn(C(C)C)c2n1
: