Target
Cyclin-dependent kinase 2
Ligand
BDBM50314074
Substrate
Meas. Tech.
Kinase Inhibition Assay
pH
7.4±0
Temperature
277.15±0 K
IC50
2.09e+4±n/a nM
Citation
 Dalgarno, DStehle, TNarula, SSchelling, Pvan Schravendijk, MRAdams, SAndrade, LKeats, JRam, MJin, LGrossman, TMacNeil, IMetcalf, CShakespeare, WWang, YKeenan, TSundaramoorthi, RBohacek, RWeigele, MSawyer, T Structural basis of Src tyrosine kinase inhibition with a new class of potent and selective trisubstituted purine-based compounds. Chem Biol Drug Des 67:46-57 (2006)  
Target
Name:
Cyclin-dependent kinase 2
Synonyms:
CDK2 CDK2_HUMAN Cell division protein kinase 2 Protein cereblon/Cyclin-dependent kinase 2 | p33 protein kinase
Type:
Enzyme Subunit
Mol. Mass.:
33938.17
Organism:
Homo sapiens (Human)
Description:
P24941
Residue:
298
  
Inhibitor
Name:
BDBM50314074
Synonyms:
2,6,9-Trisubstitute purine, 6 (AP23464) 3-[2-(2-CYCLOPENTYL-6-{[4-(DIMETHYLPHOSPHORYL)PHENYL]AMINO}-9H-PURIN-9-YL)ETHYL]PHENOL CHEMBL1089405
Type:
Small organic molecule
Emp. Form.:
C26H30N5O2P
Mol. Mass.:
475.5225
SMILES:
CP(C)(=O)c1ccc(Nc2nc(nc3n(CCc4cccc(O)c4)cnc23)C2CCCC2)cc1
: