Target
Proto-oncogene tyrosine-protein kinase Src
Ligand
BDBM81622
Substrate
Meas. Tech.
Kinase Inhibition Assay
pH
7.4±0
Temperature
277.15±0 K
IC50
239±n/a nM
Citation
 Dalgarno, DStehle, TNarula, SSchelling, Pvan Schravendijk, MRAdams, SAndrade, LKeats, JRam, MJin, LGrossman, TMacNeil, IMetcalf, CShakespeare, WWang, YKeenan, TSundaramoorthi, RBohacek, RWeigele, MSawyer, T Structural basis of Src tyrosine kinase inhibition with a new class of potent and selective trisubstituted purine-based compounds. Chem Biol Drug Des 67:46-57 (2006)  
Target
Name:
Proto-oncogene tyrosine-protein kinase Src
Synonyms:
Calmodulin/Proto-oncogene tyrosine-protein kinase Src Proto-oncogene c-Src SRC SRC_HUMAN V-src sarcoma (Schmidt-Ruppin A-2) viral oncogene homolog (avian) p60-Src | pp60c-src
Type:
Protein
Mol. Mass.:
59838.60
Organism:
Homo sapiens (Human)
Description:
P12931
Residue:
536
  
Inhibitor
Name:
BDBM81622
Synonyms:
2,6,9-Trisubstitute purine, 8
Type:
Small organic molecule
Emp. Form.:
C21H31N7O5P2
Mol. Mass.:
523.4623
SMILES:
CC(C)n1cnc2c(Nc3ccc(cc3)P(O)(=O)CP(O)(O)=O)nc(NC3CCC(N)CC3)nc12
: