Target
UDP-N-acetylmuramoyl-tripeptide--D-alanyl-D-alanine ligase
Ligand
BDBM50137775
Substrate
Meas. Tech.
Inhibition Assay
IC50
1e+3±n/a nM
Citation
 Stamper, GFLongenecker, KLFry, EHJakob, CGFlorjancic, ASGu, YGAnderson, DDCooper, CSZhang, TClark, RFCia, YBlack-Schaefer, CLOwen McCall, JLerner, CGHajduk, PJBeutel, BAStoll, VS Structure-based optimization of MurF inhibitors. Chem Biol Drug Des 67:58-65 (2006)  
Target
Name:
UDP-N-acetylmuramoyl-tripeptide--D-alanyl-D-alanine ligase
Synonyms:
MurF (S. pneumoniae) UDP-N-acetylmuramoylalanine-D-glutamyl-lysine-D-alanyl-D-alanine ligase
Type:
Protein
Mol. Mass.:
50482.72
Organism:
Streptococcus pneumoniae (Firmicutes)
Description:
S. pneumoniae MurF
Residue:
457
  
Inhibitor
Name:
BDBM50137775
Synonyms:
2,4-DICHLORO-N-(3-CYANO-4,5,6,7-TETRAHYDRO-BENZOTHIOPHEN-2YL)-5-(MORPHOLINE-4-SULFONYL)-BENZAMIDE CHEMBL327236 | MurF inhibitor, 1
Type:
Small organic molecule
Emp. Form.:
C20H19Cl2N3O4S2
Mol. Mass.:
500.419
SMILES:
Clc1cc(Cl)c(cc1C(=O)Nc1sc2CCCCc2c1C#N)S(=O)(=O)N1CCOCC1
: