Target
UDP-N-acetylmuramoyl-tripeptide--D-alanyl-D-alanine ligase
Ligand
BDBM50137767
Substrate
Meas. Tech.
Inhibition Assay
IC50
6.2e+4±n/a nM
Citation
 Stamper, GFLongenecker, KLFry, EHJakob, CGFlorjancic, ASGu, YGAnderson, DDCooper, CSZhang, TClark, RFCia, YBlack-Schaefer, CLOwen McCall, JLerner, CGHajduk, PJBeutel, BAStoll, VS Structure-based optimization of MurF inhibitors. Chem Biol Drug Des 67:58-65 (2006)  
Target
Name:
UDP-N-acetylmuramoyl-tripeptide--D-alanyl-D-alanine ligase
Synonyms:
MurF (S. pneumoniae) UDP-N-acetylmuramoylalanine-D-glutamyl-lysine-D-alanyl-D-alanine ligase
Type:
Protein
Mol. Mass.:
50482.72
Organism:
Streptococcus pneumoniae (Firmicutes)
Description:
S. pneumoniae MurF
Residue:
457
  
Inhibitor
Name:
BDBM50137767
Synonyms:
2-Chloro-N-(3-cyano-5,6-dihydro-4H-cyclopenta[b]thiophen-2-yl)-4-methylamino-5-(morpholine-4-sulfonyl)-benzamide CHEMBL419502 | MurF inhibitor, 10
Type:
Small organic molecule
Emp. Form.:
C20H21ClN4O4S2
Mol. Mass.:
480.988
SMILES:
CNc1cc(Cl)c(cc1S(=O)(=O)N1CCOCC1)C(=O)Nc1sc2CCCc2c1C#N
: