Target
Proto-oncogene tyrosine-protein kinase Src
Ligand
BDBM81720
Substrate
Meas. Tech.
Kinase Assay
IC50
1010±0.0 nM
Citation
 Shakespeare, WCWang, YBohacek, RKeenan, TSundaramoorthi, RMetcalf, CDilauro, ARoeloffzen, SLiu, SSaltmarsh, JParamanathan, GDalgarno, DNarula, SPradeepan, Svan Schravendijk, MRKeats, JRam, MLiou, SAdams, SWardwell, SBogus, JIuliucci, JWeigele, MXing, LBoyce, BSawyer, TK SAR of carbon-linked, 2-substituted purines: synthesis and characterization of AP23451 as a novel bone-targeted inhibitor of Src tyrosine kinase with in vivo anti-resorptive activity. Chem Biol Drug Des 71:97-105 (2008)  
Target
Name:
Proto-oncogene tyrosine-protein kinase Src
Synonyms:
Neuronal proto-oncogene tyrosine-protein kinase Src SRC_MOUSE Tyrosine-protein kinase SRC
Type:
Protein
Mol. Mass.:
60650.57
Organism:
Mus musculus (Mouse)
Description:
P05480
Residue:
541
  
Inhibitor
Name:
BDBM81720
Synonyms:
2,6,9-Trisubstituted Purine, 6
Type:
Small organic molecule
Emp. Form.:
C21H30N6O5P2
Mol. Mass.:
508.4476
SMILES:
CCn1cnc2c(Nc3ccc(cc3)P(O)(=O)CP(O)(O)=O)nc(CCC3CCNCC3)nc12
: