Target
Tubulin alpha chain
Ligand
BDBM81747
Substrate
Meas. Tech.
In Vitro Activity Assay
IC50
5.5e+4± 5e+3 nM
Citation
 Morgan, REAhn, SNzimiro, SFotie, JPhelps, MACotrill, JYakovich, AJSackett, DLDalton, JTWerbovetz, KA Inhibitors of tubulin assembly identified through screening a compound library. Chem Biol Drug Des 72:513-24 (2008)  
Target
Name:
Tubulin alpha chain
Synonyms:
Alpha-tubulin | Tubulin
Type:
Protein
Mol. Mass.:
49756.63
Organism:
Leishmania tarentolae (Sauroleishmania tarentolae)
Description:
Q1A5Y2
Residue:
451
  
Inhibitor
Name:
BDBM81747
Synonyms:
Chembridge No 9067250, Class 1, 8
Type:
Small organic molecule
Emp. Form.:
C15H14FNO5S
Mol. Mass.:
339.339
SMILES:
COC(=O)c1ccccc1NS(=O)(=O)c1ccc(OC)c(F)c1
: