Target
Muscarinic acetylcholine receptor M4
Ligand
BDBM81771
Substrate
Ki
4400±n/a nM
Comments
PDSP_1200
Citation
 Bolden, CCusack, BRichelson, E Antagonism by antimuscarinic and neuroleptic compounds at the five cloned human muscarinic cholinergic receptors expressed in Chinese hamster ovary cells. J Pharmacol Exp Ther 260:576-80 (1992) Target
Name:
Muscarinic acetylcholine receptor M4
Synonyms:
ACM4_HUMAN Cholinergic, muscarinic M4 Muscarinic acetylcholine receptor M2 and M4
Type:
Enzyme Catalytic Domain
Mol. Mass.:
53079.31
Organism:
Homo sapiens (Human)
Description:
Cholinergic, muscarinic M4 CHRM4 HUMAN M3::P08173
Residue:
479
  
Inhibitor
Name:
BDBM81771
Synonyms:
CAS_3575-80-2 NSC_15387
Type:
Small organic molecule
Emp. Form.:
C16H22FNO
Mol. Mass.:
263.3504
SMILES:
CC1CCN(CCCC(=O)c2ccc(F)cc2)CC1
: