Target
5-hydroxytryptamine receptor 1E
Ligand
BDBM50005835
Substrate
Ki
2520±n/a nM
Comments
PDSP_1788
Citation
 Zgombick, JMSchechter, LEMacchi, MHartig, PRBranchek, TAWeinshank, RL Human gene S31 encodes the pharmacologically defined serotonin 5-hydroxytryptamine1E receptor. Mol Pharmacol 42:180-5 (1992) Target
Name:
5-hydroxytryptamine receptor 1E
Synonyms:
5-HT-1E 5-Hydroxytryptamine Receptor Subtype 1E (5HT1E) 5-hydroxytryptamine receptor 1E (5-HT-1E) (S31) 5HT1E_HUMAN S31 Serotonin 1e (5-HT1e) receptor | Serotonin Receptor 1E
Type:
G Protein-Coupled Receptor (GPCR)
Mol. Mass.:
41697.80
Organism:
Homo sapiens (Human)
Description:
gi_112822
Residue:
365
  
Inhibitor
Name:
BDBM50005835
Synonyms:
(3-[2-(dimethylamino)ethyl]-1H-indol-5-yl)-N-methylmethanesulfonamide 1-{3-[2-(dimethylamino)ethyl]-1H-indol-5-yl}-N-methylmethanesulfonamide 3-[2-(dimethylamino)ethyl]-N-methylindole-5-methanesulfonamide SUMATRIPTAN Sumax
Type:
Small organic molecule
Emp. Form.:
C14H21N3O2S
Mol. Mass.:
295.4
SMILES:
CNS(=O)(=O)Cc1ccc2[nH]cc(CCN(C)C)c2c1
: