Target
5-hydroxytryptamine 1D receptor
Ligand
BDBM50019443
Substrate
Ki
6300±n/a nM
Comments
PDSP_1495
Citation
 Weinshank, RLZgombick, JMMacchi, MJBranchek, TAHartig, PR Human serotonin 1D receptor is encoded by a subfamily of two distinct genes: 5-HT1D alpha and 5-HT1D beta. Proc Natl Acad Sci U S A 89:3630-4 (1992)  
Target
Name:
5-hydroxytryptamine 1D receptor
Synonyms:
5-hydroxytryptamine 1D receptor (5HT1D) | HTR1D
Type:
Protein
Mol. Mass.:
12731.52
Organism:
Bos taurus (Bovine)
Description:
Q8MI13
Residue:
119
  
Inhibitor
Name:
BDBM50019443
Synonyms:
1-(1H-Indol-4-yloxy)-3-isopropylamino-propan-2-ol 1-(1H-Indol-4-yloxy)-3-isopropylamino-propan-2-ol(pindolol) LB-46 PINDOLOL,(-) VISKAZIDE | VISKEN
Type:
Small organic molecule
Emp. Form.:
C14H20N2O2
Mol. Mass.:
248.3208
SMILES:
CC(C)NCC(O)COc1cccc2[nH]ccc12
: