Target
Alpha-2B adrenergic receptor
Ligand
BDBM81814
Substrate
Ki
25±n/a nM
Comments
PDSP_1703
Citation
 Blaxall, HSMurphy, TJBaker, JCRay, CBylund, DB Characterization of the alpha-2C adrenergic receptor subtype in the opossum kidney and in the OK cell line. J Pharmacol Exp Ther 259:323-9 (1991) Target
Name:
Alpha-2B adrenergic receptor
Synonyms:
ADA2B_RAT Adrenergic receptor alpha Alpha-2B adrenergic receptor Alpha-2B adrenoreceptor | adrenergic Alpha2B
Type:
Enzyme Catalytic Domain
Mol. Mass.:
50379.83
Organism:
NEONATAL RAT
Description:
adrenergic Alpha2B ADRA2B NEONATAL RAT::P19328
Residue:
453
  
Inhibitor
Name:
BDBM81814
Synonyms:
5H-THIAZOLO[3,2A]PYRIMIDIN-5-ONE, 6-[2-[4-(4-FLUOROBENZOYL)-1-PIPERIDINYL]ETHYL]-2,3-DIHYDRO-7-METHYL- SEPTOPERONE | SETOPERONE
Type:
Small organic molecule
Emp. Form.:
C21H24FN3O2S
Mol. Mass.:
401.498
SMILES:
Cc1nc2SCCn2c(=O)c1CCN1CCC(CC1)C(=O)c1ccc(F)cc1
: