Target
5-hydroxytryptamine receptor 2C
Ligand
BDBM81819
Substrate
Ki
>10000±n/a nM
Comments
PDSP_2652
Citation
 Garritsen, AIjzerman, APTulp, MTCragoe, EJSoudijn, W Receptor binding profiles of amiloride analogues provide no evidence for a link between receptors and the Na+/H+ exchanger, but indicate a common structure on receptor proteins. J Recept Res 11:891-907 (1991)  
Target
Name:
5-hydroxytryptamine receptor 2C
Synonyms:
5-HT2C | HTR2C
Type:
Enzyme Catalytic Domain
Mol. Mass.:
51519.58
Organism:
PIG
Description:
G7ZKZ7
Residue:
457
  
Inhibitor
Name:
BDBM81819
Synonyms:
Benzamil CHEMBL212579 | NSC_108107
Type:
Small organic molecule
Emp. Form.:
C13H14ClN7O
Mol. Mass.:
319.75
SMILES:
NC(NC(=O)c1nc(Cl)c(N)nc1N)=NCc1ccccc1
: