Target
Hyaluronidase-1
Ligand
BDBM81864
Substrate
Meas. Tech.
Stains-all Assay
pH
7±0
Temperature
310.15±0 K
IC50
3.304e+4±n/a nM
Citation
 Olgen, SKaessler, ANebioglu, DJose, J New potent indole derivatives as hyaluronidase inhibitors. Chem Biol Drug Des 70:547-51 (2007)  
Target
Name:
Hyaluronidase-1
Synonyms:
HYAL1 Hyaluronidase Hyaluronoglucosaminidase-1 | LUCA1
Type:
Protein
Mol. Mass.:
48369.09
Organism:
Homo sapiens (Human)
Description:
Q1279
Residue:
435
  
Inhibitor
Name:
BDBM81864
Synonyms:
N-Substituted indole-2- and 3-carboxamide derivative, 7
Type:
Small organic molecule
Emp. Form.:
C23H18ClFN2O
Mol. Mass.:
392.853
SMILES:
Fc1ccc(Cn2c(cc3ccccc23)C(=O)NCc2ccc(Cl)cc2)cc1
: