Target
Dihydrofolate reductase
Ligand
BDBM50298802
Substrate
Meas. Tech.
Enzyme Inhibition Assay
IC50
10±0.0 nM
Citation
 Liu, JBolstad, DBSmith, AEPriestley, NDWright, DLAnderson, AC Probing the active site of Candida glabrata dihydrofolate reductase with high resolution crystal structures and the synthesis of new inhibitors. Chem Biol Drug Des 73:62-74 (2009)  
Target
Name:
Dihydrofolate reductase
Synonyms:
Dihydrofolate Reductase (DHFR)
Type:
Protein
Mol. Mass.:
25053.64
Organism:
Candida Glabrata
Description:
Q6FPH0
Residue:
217
  
Inhibitor
Name:
BDBM50298802
Synonyms:
(+/-)-5-(3-(4'-tert-butyl-5-methoxybiphenyl-3-yl)but-1-ynyl)-6-methylpyrimidine-2,4-diamine CHEMBL578424
Type:
Small organic molecule
Emp. Form.:
C26H30N4O
Mol. Mass.:
414.5426
SMILES:
COc1cc(cc(c1)-c1ccc(cc1)C(C)(C)C)C(C)C#Cc1c(C)nc(N)nc1N
: