Target
Muscarinic acetylcholine receptor M1
Ligand
BDBM39342
Substrate
Ki
190±n/a nM
Comments
PDSP_361
Citation
 Mei, LLai, JYamamura, HIRoeske, WR Pharmacologic comparison of selected agonists for the M1 muscarinic receptor in transfected murine fibroblast cells (B82). J Pharmacol Exp Ther 256:689-94 (1991) Target
Name:
Muscarinic acetylcholine receptor M1
Synonyms:
ACM1_HUMAN Cholinergic receptor, muscarinic 1 | Cholinergic, muscarinic M1
Type:
Protein
Mol. Mass.:
51442.54
Organism:
Homo sapiens (Human)
Description:
P11229
Residue:
460
  
Inhibitor
Name:
BDBM39342
Synonyms:
2-aminocarbonyloxypropyl(trimethyl)azanium;chloride 2-carbamoyloxypropyl(trimethyl)azanium;chloride BETHANECHOL CHLORIDE Hermes, Myo Myotonine cid_11548
Type:
Small organic molecule
Emp. Form.:
C7H17N2O2
Mol. Mass.:
161.2215
SMILES:
CC(C[N+](C)(C)C)OC(N)=O
: