Target
D(1A) dopamine receptor
Ligand
BDBM50026957
Substrate
Ki
4±n/a nM
Comments
PDSP_268
Citation
 Sunahara, RKGuan, HCO'Dowd, BFSeeman, PLaurier, LGNg, GGeorge, SRTorchia, JVan Tol, HHNiznik, HB Cloning of the gene for a human dopamine D5 receptor with higher affinity for dopamine than D1. Nature 350:614-9 (1991)  
Target
Name:
D(1A) dopamine receptor
Synonyms:
DA D1 receptor DRD1 Dopamine D1 receptor Dopamine D1A
Type:
Enzyme
Mol. Mass.:
49303.43
Organism:
Homo sapiens (Human)
Description:
P21728
Residue:
446
  
Inhibitor
Name:
BDBM50026957
Synonyms:
(cis) 2-{4-[3-(2-Trifluoromethyl-thioxanthen-9-ylidene)-propyl]-piperazin-1-yl}-ethanol(Flupentixol) 2-(4-{3-[2-Trifluoromethyl-thioxanthen-(9E)-ylidene]-propyl}-piperazin-1-yl)-ethanol FLUPENTHIXOL, Alpha Flupenthixol | Flupenthixol, Beta
Type:
Small organic molecule
Emp. Form.:
C23H25F3N2OS
Mol. Mass.:
434.518
SMILES:
OCCN1CCN(CC\C=C2/c3ccccc3Sc3ccc(cc23)C(F)(F)F)CC1
: