Target
Dopamine receptor D4
Ligand
BDBM21395
Substrate
Ki
148±n/a nM
Comments
PDSP_1014
Citation
 Van Tol, HHBunzow, JRGuan, HCSunahara, RKSeeman, PNiznik, HBCivelli, O Cloning of the gene for a human dopamine D4 receptor with high affinity for the antipsychotic clozapine. Nature 350:610-4 (1991)  
Target
Name:
Dopamine receptor D4
Synonyms:
DOPAMINE D2 Long DRD2 | Dopamine receptor D4
Type:
Enzyme Catalytic Domain
Mol. Mass.:
43731.97
Organism:
CANINE
Description:
Q589Y6
Residue:
421
  
Inhibitor
Name:
BDBM21395
Synonyms:
3-(2-(4-(4-Fluorobenzoyl)piperidinol)ethyl)-2,4(1H,3H)-quinazolinedione CHEMBL1628637 Ketanserin R-41-468 [3H]-Ketanserin
Type:
radiolabeled ligand
Emp. Form.:
C22H22FN3O3
Mol. Mass.:
395.4268
SMILES:
Fc1ccc(cc1)C(=O)C1CCN(CCn2c(=O)[nH]c3ccccc3c2=O)CC1
: