Target
5-hydroxytryptamine 1D receptor
Ligand
BDBM50136166
Substrate
Ki
3890.45±n/a nM
Comments
PDSP_832
Citation
 Wong, DTThrelkeld, PGRobertson, DW Affinities of fluoxetine, its enantiomers, and other inhibitors of serotonin uptake for subtypes of serotonin receptors. Neuropsychopharmacology 5:43-7 (1991) Target
Name:
5-hydroxytryptamine 1D receptor
Synonyms:
5-hydroxytryptamine 1D receptor (5HT1D) | HTR1D
Type:
Protein
Mol. Mass.:
12731.52
Organism:
Bos taurus (Bovine)
Description:
Q8MI13
Residue:
119
  
Inhibitor
Name:
BDBM50136166
Synonyms:
(3R)-N-methyl-3-phenyl-3-[4-(trifluoromethyl)phenoxy]propan-1-amine CHEMBL153036 Methyl-[(R)-3-phenyl-3-(4-trifluoromethyl-phenoxy)-propyl]-amine | Methyl-[3-phenyl-3-(4-trifluoromethyl-phenoxy)-propyl]-amine
Type:
Small organic molecule
Emp. Form.:
C17H18F3NO
Mol. Mass.:
309.3261
SMILES:
CNCC[C@@H](Oc1ccc(cc1)C(F)(F)F)c1ccccc1
: