Target
Glutamate receptor 3
Ligand
BDBM81878
Substrate
Ki
>10000±n/a nM
Comments
PDSP_3409
Citation
 Madsen, UFerkany, JWJones, BEEbert, BJohansen, TNHolm, TKrogsgaard-Larsen, P NMDA receptor agonists derived from ibotenic acid. Preparation, neuroexcitation and neurotoxicity. Eur J Pharmacol 189:381-91 (1990)  
Target
Name:
Glutamate receptor 3
Synonyms:
GRIA3_RAT Glutamate receptor 3 Glutamate-AMPA | Gria3
Type:
Enzyme Catalytic Domain
Mol. Mass.:
100383.57
Organism:
RAT
Description:
Glutamate-AMPA GRIA3 RAT::P19492
Residue:
888
  
Inhibitor
Name:
BDBM81878
Synonyms:
N-methyl-AMPA
Type:
Small organic molecule
Emp. Form.:
C8H12N2O4
Mol. Mass.:
200.1919
SMILES:
CNC(Cc1c(C)o[nH]c1=O)C(O)=O
: