Target
5-hydroxytryptamine receptor 2C
Ligand
BDBM50035057
Substrate
Ki
81±n/a nM
Comments
PDSP_779
Citation
 Schipper, JTulp, MTSijbesma, H Neurochemical profile of eltoprazine. Drug Metabol Drug Interact 8:85-114 (1990)  
Target
Name:
5-hydroxytryptamine receptor 2C
Synonyms:
5-HT2C | HTR2C
Type:
Enzyme Catalytic Domain
Mol. Mass.:
51519.58
Organism:
PIG
Description:
G7ZKZ7
Residue:
457
  
Inhibitor
Name:
BDBM50035057
Synonyms:
(eltoprazine)1-(2,3-Dihydro-benzo[1,4]dioxin-5-yl)-piperazine CHEMBL282614 | Eltoprazine
Type:
Small organic molecule
Emp. Form.:
C12H16N2O2
Mol. Mass.:
220.2676
SMILES:
C1CN(CCN1)c1cccc2OCCOc12
: