Target
Oxytocin receptor
Ligand
BDBM81891
Substrate
Ki
6.4±n/a nM
Comments
PDSP_1044
Citation
 Pettibone, DJClineschmidt, BVLis, EVReiss, DRTotaro, JAWoyden, CJBock, MGFreidinger, RMTung, RDVeber, DF In vitro pharmacological profile of a novel structural class of oxytocin antagonists. J Pharmacol Exp Ther 256:304-8 (1991) Target
Name:
Oxytocin receptor
Synonyms:
OXTR Oxytocin
Type:
Enzyme Catalytic Domain
Mol. Mass.:
42932.85
Organism:
Rhesus
Description:
Oxytocin OXTR Rhesus::P56494
Residue:
389
  
Inhibitor
Name:
BDBM81891
Synonyms:
CAS_188397 NSC_188397
Type:
Small organic molecule
Emp. Form.:
C42H56N8O6
Mol. Mass.:
768.944
SMILES:
CCC(C)C(NC(=O)C(N)Cc1ccc2ccccc2c1)C(=O)C1(CCCN1C(=O)C(N)CC1=NC(N=C1)(C(=O)N1CCCCC1)C(=O)N1CCCCC1)C=O
: