Target
Vasopressin V2 receptor
Ligand
BDBM81895
Substrate
Ki
2900±n/a nM
Comments
PDSP_1038
Citation
 Pettibone, DJClineschmidt, BVLis, EVReiss, DRTotaro, JAWoyden, CJBock, MGFreidinger, RMTung, RDVeber, DF In vitro pharmacological profile of a novel structural class of oxytocin antagonists. J Pharmacol Exp Ther 256:304-8 (1991) Target
Name:
Vasopressin V2 receptor
Synonyms:
AVPR V2 Avpr2 V2R_RAT Vasopressin receptor
Type:
G-protein coupled receptor
Mol. Mass.:
40761.85
Organism:
Rattus norvegicus (Rat)
Description:
Residue:
371
  
Inhibitor
Name:
BDBM81895
Synonyms:
Cyclo[L-Pro-D-Phe-L-Ile-1,6-didehydro-D-Pyz-1,6-didehydro-L-Pyz-N-methyl-L-Phe-] L-365,209
Type:
Small organic molecule
Emp. Form.:
C40H50N8O6
Mol. Mass.:
738.875
SMILES:
CCC(C)C1NC(=O)[C@H](Cc2ccccc2)NC(=O)[C@H]2CCCN2C(=O)[C@H](Cc2ccccc2)N(C)C(=O)[C@@H]2CCC=NN2C(=O)[C@H]2CCC=NN2C1=O
: