Target
Carbonic anhydrase 2
Ligand
BDBM33269
Substrate
Meas. Tech.
Inhibition Assay
pH
7.4±0
Temperature
298.15±0 K
Ki
638±0.0 nM
Citation
 Carta, FPothen, BMaresca, ATiwari, MSingh, VSupuran, CT Carbonic anhydrase inhibitors: inhibition of cytosolic carbonic anhydrase isozymes II and VII with simple aromatic sulfonamides and some azo dyes. Chem Biol Drug Des 74:196-202 (2009)  
Target
Name:
Carbonic anhydrase 2
Synonyms:
CA-II CAC Carbonate dehydratase II Carbonic anhydrase 2 (CA-II) Carbonic anhydrase C Carbonic anhydrase II (CA-II) Carbonic anhydrase II (hCA II) | Carbonic anhydrase isoenzyme II (hCA II)
Type:
Enzyme
Mol. Mass.:
29250.71
Organism:
Homo sapiens (Human)
Description:
P00918
Residue:
260
  
Inhibitor
Name:
BDBM33269
Synonyms:
CHEMBL277836 cid_75522 | p-Phenyldiazenyl derivative, 4
Type:
Small organic molecule
Emp. Form.:
C14H16N4O2S
Mol. Mass.:
304.367
SMILES:
CN(C)c1ccc(cc1)\N=N\c1ccc(cc1)S(N)(=O)=O
: