Target
Carbonic anhydrase 7
Ligand
BDBM81921
Substrate
Meas. Tech.
Inhibition Assay
pH
7.4±0
Temperature
298.15±0 K
Ki
4200±0.0 nM
Citation
 Carta, FPothen, BMaresca, ATiwari, MSingh, VSupuran, CT Carbonic anhydrase inhibitors: inhibition of cytosolic carbonic anhydrase isozymes II and VII with simple aromatic sulfonamides and some azo dyes. Chem Biol Drug Des 74:196-202 (2009)  
Target
Name:
Carbonic anhydrase 7
Synonyms:
CA-VII CAH7_HUMAN Carbonic anhydrase Carbonic anhydrase VII (CA VII)
Type:
Enzyme
Mol. Mass.:
29664.11
Organism:
Homo sapiens (Human)
Description:
Human cloned isozyme.
Residue:
264
  
Inhibitor
Name:
BDBM81921
Synonyms:
p-Phenyldiazenyl derivative, 6
Type:
Small organic molecule
Emp. Form.:
C15H17N3O3S
Mol. Mass.:
319.379
SMILES:
COc1ccc(cc1)\N=N\c1ccc(cc1)S(=O)(=O)N(C)C
: