Target
Adenosine receptor A1
Ligand
BDBM50006730
Substrate
Ki
0.31±n/a nM
Comments
PDSP_1618
Citation
 Klotz, KNVogt, HTawfik-Schlieper, H Comparison of A1 adenosine receptors in brain from different species by radioligand binding and photoaffinity labelling. Naunyn Schmiedebergs Arch Pharmacol 343:196-201 (1991)  
Target
Name:
Adenosine receptor A1
Synonyms:
AA1R_RABIT ADENOSINE A1 high ADORA1 | Adenosine receptor A1 (A1)
Type:
Enzyme
Mol. Mass.:
36566.33
Organism:
Oryctolagus cuniculus (Rabbit)
Description:
P34970
Residue:
328
  
Inhibitor
Name:
BDBM50006730
Synonyms:
(R)-2-Hydroxymethyl-5-[6-(1-methyl-2-phenyl-ethylamino)-purin-9-yl]-tetrahydro-furan-3,4-diol (S)-2-Hydroxymethyl-5-[6-(1-methyl-2-phenyl-ethylamino)-purin-9-yl]-tetrahydro-furan-3,4-diol 2-Hydroxymethyl-5-[6-(1-methyl-2-phenyl-ethylamino)-purin-9-yl]-tetrahydro-furan-3,4-diol ChEMBL_20163 L-2-Hydroxymethyl-5-[6-(1-methyl-2-phenyl-ethylamino)-purin-9-yl]-tetrahydro-furan-3,4-diol R-PIA | S-PIA
Type:
Small organic molecule
Emp. Form.:
C19H23N5O4
Mol. Mass.:
385.417
SMILES:
CC(Cc1ccccc1)Nc1ncnc2n(cnc12)C1OC(CO)C(O)C1O
: