Target
kappa-type opioid receptor isoform 1
Ligand
BDBM81932
Substrate
Ki
4.8±n/a nM
Comments
PDSP_7135
Citation
 Benyhe, SVarga, EHepp, JMagyar, ABorsodi, AWollemann, M Characterization of kappa 1 and kappa 2 opioid binding sites in frog (Rana esculenta) brain membrane preparation. Neurochem Res 15:899-904 (1990)  
Target
Name:
kappa-type opioid receptor isoform 1
Synonyms:
OPIATE Kappa | OPRK1
Type:
Enzyme Catalytic Domain
Mol. Mass.:
42362.28
Organism:
Frog
Description:
F7A0F2
Residue:
375
  
Inhibitor
Name:
BDBM81932
Synonyms:
(-)-alpha-(1R,5R,9R)-5,9-Dimethyl-2-L-tetrahydrofurfuryl)-2'-hydroxy-6,7-benzomorphan MR2034
Type:
Small organic molecule
Emp. Form.:
C19H27NO2
Mol. Mass.:
301.4232
SMILES:
CC1[C@H]2Cc3ccc(O)cc3[C@]1(C)CCN2C[C@H]1CCCO1
: