Target
Free fatty acid receptor 2
Ligand
BDBM271143
Substrate
Meas. Tech.
Ca-Flux Functional Assay
EC50
6.00±n/a nM
Citation
 Barker, GDavenport, RDownham, RFarnaby, WGoldby, AHannah, DHarrison, DWillems, H 3-substituted 2-amino-indole derivatives US Patent  US10059713 Publication Date 8/28/2018 
Target
Name:
Free fatty acid receptor 2
Synonyms:
FFA2 FFAR2_HUMAN GPCR43 | GPR43
Type:
PROTEIN
Mol. Mass.:
37156.44
Organism:
Homo sapiens (Human)
Description:
ChEMBL_1508993
Residue:
330
  
Inhibitor
Name:
BDBM271143
Synonyms:
7-(2,4-difluorobenzenesulfonyl)-2-methyl-4-(2-methylmorpholin-4-yl)-5H-pyrrolo[3,2-d]pyrimidin-6-amine | US10059713, Example 262
Type:
Small organic molecule
Emp. Form.:
C18H19F2N5O3S
Mol. Mass.:
423.437
SMILES:
CC1CN(CCO1)c1nc(C)nc2c(c(N)[nH]c12)S(=O)(=O)c1ccc(F)cc1F
: