Target
Free fatty acid receptor 2
Ligand
BDBM271173
Substrate
Meas. Tech.
Ca-Flux Functional Assay
EC50
2.00±n/a nM
Citation
 Barker, GDavenport, RDownham, RFarnaby, WGoldby, AHannah, DHarrison, DWillems, H 3-substituted 2-amino-indole derivatives US Patent  US10059713 Publication Date 8/28/2018 
Target
Name:
Free fatty acid receptor 2
Synonyms:
FFA2 FFAR2_HUMAN GPCR43 | GPR43
Type:
PROTEIN
Mol. Mass.:
37156.44
Organism:
Homo sapiens (Human)
Description:
ChEMBL_1508993
Residue:
330
  
Inhibitor
Name:
BDBM271173
Synonyms:
7-(2,5-difluorobenzenesulfonyl)-2-methyl-4-[(2S)-2-(trifluoromethyl)morpholin-4-yl]-5H-pyrrolo[3,2-d]pyrimidin-6-amine | US10059713, Example 292
Type:
Small organic molecule
Emp. Form.:
C18H16F5N5O3S
Mol. Mass.:
477.408
SMILES:
Cc1nc(N2CCO[C@@H](C2)C(F)(F)F)c2[nH]c(N)c(c2n1)S(=O)(=O)c1cc(F)ccc1F
: