Target
Muscarinic acetylcholine receptor M4
Ligand
BDBM50176065
Substrate
Ki
5.6±n/a nM
Comments
PDSP_111
Citation
 Waelbroeck, MTastenoy, MCamus, JChristophe, J Binding of selective antagonists to four muscarinic receptors (M1 to M4) in rat forebrain. Mol Pharmacol 38:267-73 (1990) Target
Name:
Muscarinic acetylcholine receptor M4
Synonyms:
ACM4_MOUSE Chrm-4 Mm4 mAChR | Muscarinic acetylcholine receptor
Type:
Enzyme Catalytic Domain
Mol. Mass.:
53004.88
Organism:
MOUSE
Description:
Cholinergic, muscarinic M4 CHRM4 MOUSE::P32211
Residue:
479
  
Inhibitor
Name:
BDBM50176065
Synonyms:
4-DAMP Acetic acid 4-[(4-acetoxy-phenyl)-pyridin-2-yl-methyl]-phenyl ester CHEMBL76897
Type:
Small organic molecule
Emp. Form.:
C21H26NO2
Mol. Mass.:
324.4361
SMILES:
C[N+]1(C)CCC(CC1)OC(=O)C(c1ccccc1)c1ccccc1
: