Target
Class E basic helix-loop-helix protein 22
Ligand
BDBM50281563
Substrate
Ki
17±n/a nM
Comments
PDSP_1488
Citation
 Burcher, EBuck, SHLovenberg, WO'Donohue, TL Characterization and autoradiographic localization of multiple tachykinin binding sites in gastrointestinal tract and bladder. J Pharmacol Exp Ther 236:819-31 (1986) Target
Name:
Class E basic helix-loop-helix protein 22
Synonyms:
BHE Bhlhb5 Class E basic helix-loop-helix protein 22
Type:
Enzyme Catalytic Domain
Mol. Mass.:
35220.68
Organism:
MOUSE
Description:
BHE 0 MOUSE::Q8C6A8
Residue:
355
  
Inhibitor
Name:
BDBM50281563
Synonyms:
CHEMBL414786 physalaemin
Type:
Small organic molecule
Emp. Form.:
C58H84N14O16S
Mol. Mass.:
1265.437
SMILES:
CSCC[C@H](NC(=O)[C@H](CC(C)C)NC(=O)CNC(=O)[C@H](Cc1ccc(O)cc1)NC(=O)[C@H](Cc1ccccc1)NC(=O)[C@H](CCCCN)NC(=O)[C@H](CC(N)=O)NC(=O)[C@@H]1CCCN1C(=O)[C@H](CC(O)=O)NC(=O)[C@H](C)NC(=O)C1CCC(=O)N1)C(N)=O
: