Target
D(2) dopamine receptor
Ligand
BDBM35256
Substrate
Ki
4600±n/a nM
Comments
PDSP_1235
Citation
 Grandy, DKMarchionni, MAMakam, HStofko, REAlfano, MFrothingham, LFischer, JBBurke-Howie, KJBunzow, JRServer, AC Cloning of the cDNA and gene for a human D2 dopamine receptor. Proc Natl Acad Sci U S A 86:9762-6 (1989)  
Target
Name:
D(2) dopamine receptor
Synonyms:
DOPAMINE D2 DOPAMINE D2 Short Dopamine D2 receptor Drd2
Type:
G Protein-Coupled Receptor (GPCR)
Mol. Mass.:
50931.60
Organism:
Rattus norvegicus (rat)
Description:
P61169
Residue:
444
  
Inhibitor
Name:
BDBM35256
Synonyms:
(S)-mianserin MIANSERIN MIANSERIN (-) | Tolvon
Type:
Small organic molecule
Emp. Form.:
C18H20N2
Mol. Mass.:
264.3648
SMILES:
[H][C@]12CN(C)CCN1c1ccccc1Cc1ccccc21
: