Target
D(2) dopamine receptor
Ligand
BDBM21397
Substrate
Ki
0.56±n/a nM
Comments
PDSP_1739
Citation
 Grandy, DKMarchionni, MAMakam, HStofko, REAlfano, MFrothingham, LFischer, JBBurke-Howie, KJBunzow, JRServer, AC Cloning of the cDNA and gene for a human D2 dopamine receptor. Proc Natl Acad Sci U S A 86:9762-6 (1989)  
Target
Name:
D(2) dopamine receptor
Synonyms:
DOPAMINE D2 DOPAMINE D2 Short Dopamine D2 receptor Drd2
Type:
G Protein-Coupled Receptor (GPCR)
Mol. Mass.:
50931.60
Organism:
Rattus norvegicus (rat)
Description:
P61169
Residue:
444
  
Inhibitor
Name:
BDBM21397
Synonyms:
8-[4-(4-fluorophenyl)-4-keto-butyl]-1-phenyl-1,3,8-triazaspiro[4.5]decan-4-one 8-[4-(4-fluorophenyl)-4-oxobutyl]-1-phenyl-1,3,8-triazaspiro[4.5]decan-4-one MLS000028615 SPIPERONE US9359372, Spiperone cid_5265
Type:
radiolabeled ligand
Emp. Form.:
C23H26FN3O2
Mol. Mass.:
395.4698
SMILES:
Fc1ccc(cc1)C(=O)CCCN1CCC2(CC1)N(CNC2=O)c1ccccc1
: