Target
Leucyl-cystinyl aminopeptidase
Ligand
BDBM271318
Substrate
Meas. Tech.
Inhibition of IRAP Assay
IC50
1.000±n/a nM
Citation
 Kawaguchi, KIshihata, AInagaki, YTsuchiya, KHanadate, TKanai, AKaizawa, HKazami, JMorikawa, HHiramoto, MEnjo, KTakamatsu, H Pyridine derivative US Patent  US10059720 Publication Date 8/28/2018 
Target
Name:
Leucyl-cystinyl aminopeptidase
Synonyms:
Cystinyl aminopeptidase Insulin-regulated membrane aminopeptidase Irap Leucyl-cystinyl aminopeptidase Otase P-LAP Vesicle protein of 165 kDa | Vp165
Type:
PROTEIN
Mol. Mass.:
117179.39
Organism:
Rattus norvegicus
Description:
ChEMBL_98523
Residue:
1025
  
Inhibitor
Name:
BDBM271318
Synonyms:
US10059720, Example 133 | US10975091, Example 133
Type:
Small organic molecule
Emp. Form.:
C19H23F3N2O4
Mol. Mass.:
400.3921
SMILES:
N[C@@H](CCC(F)(F)F)[C@](O)(Cc1nccc2oc(CCC3CC3)cc12)C(O)=O
: