Target
Sodium-dependent serotonin transporter
Ligand
BDBM50026952
Substrate
Ki
51±n/a nM
Comments
PDSP_3887
Citation
 Hyttel, JLarsen, JJ Neurochemical profile of Lu 19-005, a potent inhibitor of uptake of dopamine, noradrenaline, and serotonin. J Neurochem 44:1615-22 (1985)  
Target
Name:
Sodium-dependent serotonin transporter
Synonyms:
5-HT Transporter 5HT transporter Anandamid membrane transporter, AMT Monoamine transporters; Norepinephrine & serotonin Slc6a4 Sodium-dependent serotonin transporter (SERT) | imipramine receptor
Type:
Multi-pass membrane protein
Mol. Mass.:
70168.43
Organism:
Rattus norvegicus (rat)
Description:
P31652
Residue:
630
  
Inhibitor
Name:
BDBM50026952
Synonyms:
(cis) [3-(3,4-Dichloro-phenyl)-bicyclo[2.2.2]oct-2-ylmethyl]-dimethyl-amine(LR 5182) LR 5182 | [(2R,3S)-3-(3,4-Dichloro-phenyl)-bicyclo[2.2.2]oct-2-ylmethyl]-dimethyl-amine
Type:
Small organic molecule
Emp. Form.:
C17H23Cl2N
Mol. Mass.:
312.277
SMILES:
CN(C)C[C@@H]1C2CCC(CC2)[C@@H]1c1ccc(Cl)c(Cl)c1
: