Target
Muscarinic acetylcholine receptor M2
Ligand
BDBM50176065
Substrate
Ki
10.8±n/a nM
Comments
PDSP_111
Citation
 Gies, JPBertrand, CVanderheyden, PWaeldele, FDumont, PPauli, GLandry, Y Characterization of muscarinic receptors in human, guinea pig and rat lung. J Pharmacol Exp Ther 250:309-15 (1989) Target
Name:
Muscarinic acetylcholine receptor M2
Synonyms:
ACM2_PIG Cholinergic, muscarinic LOC100715343 Muscarinic receptor 2
Type:
Enzyme Catalytic Domain
Mol. Mass.:
51688.65
Organism:
GUINEA PIG
Description:
Cholinergic, muscarinic 0 GUINEA PIG::P06199
Residue:
466
  
Inhibitor
Name:
BDBM50176065
Synonyms:
4-DAMP Acetic acid 4-[(4-acetoxy-phenyl)-pyridin-2-yl-methyl]-phenyl ester CHEMBL76897
Type:
Small organic molecule
Emp. Form.:
C21H26NO2
Mol. Mass.:
324.4361
SMILES:
C[N+]1(C)CCC(CC1)OC(=O)C(c1ccccc1)c1ccccc1
: