Target
Adenosine receptor A2a
Ligand
BDBM81971
Substrate
Ki
210±n/a nM
Comments
PDSP_755
Citation
 Lohse, MJKlotz, KNLindenborn-Fotinos, JReddington, MSchwabe, UOlsson, RA 8-Cyclopentyl-1,3-dipropylxanthine (DPCPX)--a selective high affinity antagonist radioligand for A1 adenosine receptors. Naunyn Schmiedebergs Arch Pharmacol 336:204-10 (1987)  
Target
Name:
Adenosine receptor A2a
Synonyms:
A2A adenosine receptor (hA2A) ADENOSINE A2 ADORA2 Adenosine A2A receptor (A2AAR)
Type:
G Protein-Coupled Receptor (GPCR)
Mol. Mass.:
44716.46
Organism:
Homo sapiens (Human)
Description:
P29274
Residue:
412
  
Inhibitor
Name:
BDBM81971
Synonyms:
1,3-Diethyl-8-phenyl-3,7-dihydro-purine-2,6-dione CHEMBL11348 NSC_1328
Type:
Small organic molecule
Emp. Form.:
C15H16N4O2
Mol. Mass.:
284.3131
SMILES:
CCn1c2nc([nH]c2c(=O)n(CC)c1=O)-c1ccccc1
: