Target
Glutamate receptor ionotropic, NMDA 1
Ligand
BDBM81977
Substrate
Ki
350±n/a nM
Comments
PDSP_618
Citation
 Murphy, DEHutchison, AJHurt, SDWilliams, MSills, MA Characterization of the binding of [3H]-CGS 19755: a novel N-methyl-D-aspartate antagonist with nanomolar affinity in rat brain. Br J Pharmacol 95:932-8 (1988)  
Target
Name:
Glutamate receptor ionotropic, NMDA 1
Synonyms:
Glutamate (NMDA) receptor subunit zeta 1 Glutamate-NMDA-Channel Glutamate-NMDA-Polyamine NMDA Nmdar1 | phencyclidine
Type:
Enzyme Catalytic Domain
Mol. Mass.:
105533.40
Organism:
RAT
Description:
P35439
Residue:
938
  
Inhibitor
Name:
BDBM81977
Synonyms:
CAS_79055-68-8 D-AP5 | D-APV
Type:
Small organic molecule
Emp. Form.:
C5H12NO5P
Mol. Mass.:
197.1262
SMILES:
N[C@H](CCCP(O)(O)=O)C(O)=O
: