Target
Glutamate receptor ionotropic, NMDA 1
Ligand
BDBM26431
Substrate
Ki
8100±n/a nM
Comments
PDSP_649
Citation
 Murphy, DEHutchison, AJHurt, SDWilliams, MSills, MA Characterization of the binding of [3H]-CGS 19755: a novel N-methyl-D-aspartate antagonist with nanomolar affinity in rat brain. Br J Pharmacol 95:932-8 (1988)  
Target
Name:
Glutamate receptor ionotropic, NMDA 1
Synonyms:
Glutamate (NMDA) receptor subunit zeta 1 Glutamate-NMDA-Channel Glutamate-NMDA-Polyamine NMDA Nmdar1 | phencyclidine
Type:
Enzyme Catalytic Domain
Mol. Mass.:
105533.40
Organism:
RAT
Description:
P35439
Residue:
938
  
Inhibitor
Name:
BDBM26431
Synonyms:
(2R)-2-aminopentanedioic acid D-Glu D-[14C]Glu
Type:
radiolabeled amino acid
Emp. Form.:
C5H9NO4
Mol. Mass.:
147.1293
SMILES:
N[C@H](CCC(O)=O)C(O)=O
: