Target
Alpha-2A adrenergic receptor
Ligand
BDBM50013515
Substrate
Ki
15±n/a nM
Comments
PDSP_1987
Citation
 Hieble, JPDeMarinis, RMFowler, PJMatthews, WD Selective alpha-2 adrenoceptor blockade by SK&F 86466: in vitro characterization of receptor selectivity. J Pharmacol Exp Ther 236:90-6 (1986) Target
Name:
Alpha-2A adrenergic receptor
Synonyms:
ADA2A_CAVPO Alpha-2A adrenergic receptor | adrenergic Alpha2
Type:
Enzyme Catalytic Domain
Mol. Mass.:
48933.12
Organism:
GUINEA PIG
Description:
adrenergic Alpha2 0 GUINEA PIG::Q60474
Residue:
450
  
Inhibitor
Name:
BDBM50013515
Synonyms:
(+)-yohimbine 17alpha-hydroxyyohimban-16alpha-carboxylic acid methyl ester CORYNANTHINE Quebrachin YOHIMBINE CHLORIDE Yohimbine cid_8969 methyl 17alpha-hydroxyyohimban-16alpha-carboxylate yohimbic acid methyl ester
Type:
Small organic molecule
Emp. Form.:
C21H26N2O3
Mol. Mass.:
354.4427
SMILES:
COC(=O)[C@H]1[C@@H](O)CC[C@H]2CN3CCc4c([nH]c5ccccc45)[C@@H]3C[C@H]12
: