Target
5-hydroxytryptamine receptor 1A
Ligand
BDBM50026044
Substrate
Ki
2950±n/a nM
Comments
PDSP_2280
Citation
 Hall, HSällemark, MJerning, E Effects of remoxipride and some related new substituted salicylamides on rat brain receptors. Acta Pharmacol Toxicol (Copenh) 58:61-70 (1986)  
Target
Name:
5-hydroxytryptamine receptor 1A
Synonyms:
5-HT-1A 5-HT1A 5-hydroxytryptamine receptor 1A (5HT1A) 5ht1a Htr1a Serotonin 1a (5-HT1a) receptor/Adrenergic receptor alpha-1 | Serotonin receptor 1A
Type:
G Protein-Coupled Receptor (GPCR)
Mol. Mass.:
46445.29
Organism:
Rattus norvegicus (rat)
Description:
Binding assays were performed using rat hippocampal membranes.
Residue:
422
  
Inhibitor
Name:
BDBM50026044
Synonyms:
3-Bromo-5-ethyl-N-(1-ethyl-pyrrolidin-2-ylmethyl)-6-hydroxy-2-methoxy-benzamide CHEMBL161668
Type:
Small organic molecule
Emp. Form.:
C17H25BrN2O3
Mol. Mass.:
385.296
SMILES:
CCN1CCC[C@H]1CNC(=O)c1c(O)c(CC)cc(Br)c1OC
: