Target
Alpha-2C adrenergic receptor
Ligand
BDBM50017720
Substrate
Ki
1.6±n/a nM
Comments
PDSP_1500
Citation
 Boyajian, CLLeslie, FM Pharmacological evidence for alpha-2 adrenoceptor heterogeneity: differential binding properties of [3H]rauwolscine and [3H]idazoxan in rat brain. J Pharmacol Exp Ther 241:1092-8 (1987) Target
Name:
Alpha-2C adrenergic receptor
Synonyms:
ADA2C_RAT Adrenergic receptor alpha adrenergic Alpha2 | adrenergic Alpha2C
Type:
Enzyme Catalytic Domain
Mol. Mass.:
49890.50
Organism:
RAT
Description:
adrenergic Alpha2 0 RAT::P22086
Residue:
458
  
Inhibitor
Name:
BDBM50017720
Synonyms:
1-(2,3-Dihydro-benzo[1,4]dioxin-2-ylmethyl)-piperidine CHEMBL31836 Piperoxan
Type:
Small organic molecule
Emp. Form.:
C14H19NO2
Mol. Mass.:
233.3062
SMILES:
C(C1COc2ccccc2O1)N1CCCCC1
: