Target
Interleukin-1 receptor-associated kinase 4
Ligand
BDBM271346
Substrate
Meas. Tech.
IRAK4 Enzymatic Assay
pH
7±n/a
IC50
<100±n/a nM
Comments
extracted
Citation
 Jorand-Lebrun, CKulkarni, SChristmann-Franck, S Macrocyclic pyridazinone derivatives US Patent  US10064861 Publication Date 9/4/2018 
Target
Name:
Interleukin-1 receptor-associated kinase 4
Synonyms:
IRAK-4 IRAK4_HUMAN Interleukin-1 receptor-associated kinase 4 (IRAK4) | Renal carcinoma antigen NY-REN-64
Type:
Protein
Mol. Mass.:
51519.08
Organism:
Homo sapiens (Human)
Description:
Q9NWZ3
Residue:
460
  
Inhibitor
Name:
BDBM271346
Synonyms:
US10064861, Compound 2
Type:
Small organic molecule
Emp. Form.:
C27H21N5O2
Mol. Mass.:
447.4879
SMILES:
O=C1Nc2nc3ccccc3n2CCc2cccc(c2)-c2ccc(=O)n(Cc3cccc1c3)n2
: