Target
Alpha-2B adrenergic receptor
Ligand
BDBM50016897
Substrate
Ki
14±n/a nM
Comments
PDSP_544
Citation
 Murphy, TJBylund, DB Characterization of alpha-2 adrenergic receptors in the OK cell, an opossum kidney cell line. J Pharmacol Exp Ther 244:571-8 (1988) Target
Name:
Alpha-2B adrenergic receptor
Synonyms:
ADA2B_DIDVI Alpha-2B adrenergic receptor | adrenergic Alpha2
Type:
Enzyme Catalytic Domain
Mol. Mass.:
41875.91
Organism:
OPOSSUM
Description:
adrenergic Alpha2 0 OPOSSUM::O77715
Residue:
382
  
Inhibitor
Name:
BDBM50016897
Synonyms:
2-(2,6-dichloroanilino)-1,3-diazacyclopentene-(2) CLONIDINE clonidine (amino form)
Type:
Small organic molecule
Emp. Form.:
C9H9Cl2N3
Mol. Mass.:
230.094
SMILES:
Clc1cccc(Cl)c1\[#7]=[#6]-1\[#7]-[#6]-[#6]-[#7]-1
: