Target
D(1A) dopamine receptor
Ligand
BDBM81873
Substrate
Ki
5000±n/a nM
Comments
PDSP_1156
Citation
 Andersen, PH Comparison of the pharmacological characteristics of [3H]raclopride and [3H]SCH 23390 binding to dopamine receptors in vivo in mouse brain. Eur J Pharmacol 146:113-20 (1988)  
Target
Name:
D(1A) dopamine receptor
Synonyms:
D(1A) dopamine receptor DRD1_MOUSE Dopamine receptor Drd1a | Gpcr15
Type:
Enzyme
Mol. Mass.:
49613.93
Organism:
Mus musculus (Mouse)
Description:
Q61616
Residue:
446
  
Inhibitor
Name:
BDBM81873
Synonyms:
CAS_55397 NSC_55397 | QUINPIROLE
Type:
Small organic molecule
Emp. Form.:
C13H21N3
Mol. Mass.:
219.3259
SMILES:
CCCN1CCCC2Cc3[nH]ncc3CC12
: