Target
5-hydroxytryptamine receptor 1A/1B/1D/2C
Ligand
BDBM67545
Substrate
Ki
>10000±n/a nM
Comments
PDSP_1532
Citation
 Richelson, E Neuroleptic binding to human brain receptors: relation to clinical effects. Ann N Y Acad Sci 537:435-42 (1988)  
Target
Name:
5-hydroxytryptamine receptor 1A/1B/1D/2C
Synonyms:
5-HT1
Type:
Mol. Mass.:
Description:
TL
Components:
This complex has 0 components.
Component 1
Name:
5-hydroxytryptamine receptor 1A
Synonyms:
5-HT-1A 5-hydroxytryptamine receptor 1A (5-HT-1A) ADRB2RL1 Dopamine D2 receptor and serotonin 1a receptor HTR1A | Serotonin receptor 1A
Type:
Mol. Mass.:
46122.49
Organism:
Homo sapiens (Human)
Description:
Residue:
422
  
Component 2
Name:
5-hydroxytryptamine receptor 1B
Synonyms:
5-HT-1B 5-HT1B 5HT1B_HUMAN HTR1DB Serotonin (5-HT) receptor Serotonin Receptor 1B
Type:
G Protein-Coupled Receptor (GPCR)
Mol. Mass.:
43579.17
Organism:
Homo sapiens (Human)
Description:
Receptor binding assays were performed using human clone stably expressed in CHO cells
Residue:
390
  
Component 3
Name:
5-hydroxytryptamine receptor 2C
Synonyms:
5-HT-2C 5-HT2C-INI 5-HTR2C 5-hydroxytryptamine receptor 2C (5-HT-2C) 5HT-1C HTR1C Serotonin (5-HT3) receptor Serotonin Receptor 2C
Type:
G Protein-Coupled Receptor (GPCR)
Mol. Mass.:
51836.79
Organism:
Homo sapiens (Human)
Description:
P28335
Residue:
458
  
Component 4
Name:
5-hydroxytryptamine receptor 1D
Synonyms:
5-HT-1D 5-HT1D 5HT1D_HUMAN HTR1DA Serotonin (5-HT) receptor | Serotonin Receptor 1D
Type:
G Protein-Coupled Receptor (GPCR)
Mol. Mass.:
41920.63
Organism:
Homo sapiens (Human)
Description:
Receptor binding assays were performed using human clone stably expressed in CHO cells.
Residue:
377
  
Inhibitor
Name:
BDBM67545
Synonyms:
N,N-dimethyl-3-(10-phenothiazinyl)-1-propanamine;hydrochloride N,N-dimethyl-3-phenothiazin-10-ylpropan-1-amine;hydrochloride SR-01000000228-4 cid_5887 | dimethyl(3-phenothiazin-10-ylpropyl)amine;hydrochloride
Type:
Small organic molecule
Emp. Form.:
C17H20N2S
Mol. Mass.:
284.419
SMILES:
CN(C)CCCN1c2ccccc2Sc2ccccc12
: